first_name,last_name,address_1,address_2,city,state,zip,country,phone,email,rating,applied_for,status,applied_date,archived_date,source,linkedin,tags,notes,gender,race/ethnicity,veteran status,disability,coverletter_file,resume_file,other_file1,other_file2,other_file3,other_file4,other_file5
Hana,Altenwerth,41577 Paulette Avenue,,Nickybury,WI,94728-8365,US,,hanaaltenwerth@example.com,3,Legacy Developer,Phone interview completed,2022-02-25 23:58:29 UTC,2022-03-08 09:08:12 UTC,Google,,,,,,,,Altenwerth_cover,Altenwerth_resume,,,,,
Danyell,Wuckert,753 Marybeth Square,,Vanettafort,AZ,46371-1211,US,,danyellwuckert@example.com,4,Future Advertising Technician,Schedule Mouse-Catch-Test,2022-03-08 15:08:23 UTC,2022-03-08 15:43:55 UTC,Other fake source,,,,,,,,Wuckert_cover,Wuckert_resume,Wuckert_work_sample,Wuckert_work_sample2,Wuckert_work_sample3,,
Temicka,Franecki,8883 Pfeffer Club,,New Edie,VT,86576-7076,US,,temickafranecki@example.com,,Legacy Developer,Not selected,2022-02-20 21:31:56 UTC,2022-03-07 14:46:22 UTC,Monster,,,,,,,,Franecki_cover,Franecki_resume,,,,,
Kimi,Abbott,8439 Carmen Harbors,,Aurachester,NH,87225-4725,US,,kimiabbottphd@example.com,3,Future Real-Estate Engineer,Face-to-face interview completed,2022-01-16 17:32:33 UTC,2022-01-18 04:54:17 UTC,Other fake source,,,,,,,,Abbott_cover,Abbott_resume,Abbott_work_sample,,,,
Linh,Walsh,5597 Jong Centers,,South Maihaven,AR,90630,US,,linhwalsh@example.com,1,Legacy Developer,Not selected,2022-02-19 13:43:17 UTC,,Other fake source,,,,,,,,Walsh_cover,Walsh_resume,,,,,
Vinnie,Champlin,967 Bryce Extensions,,South Odetteshire,FL,42937-0227,US,,vinniechamplin@example.com,1,Regional Education Executive,Face-to-face interview completed,2022-03-05 23:19:52 UTC,2022-03-07 20:30:28 UTC,Other fake source,,,,,,,,Champlin_cover,Champlin_resume,,,,,
Sandy,Von,1717 Schroeder Place,,Lake Katelin,ID,71604-6552,US,,sandyvon@example.com,,Legacy Developer,Face-to-face interview completed,2022-03-01 07:31:54 UTC,2022-03-06 23:03:18 UTC,Other fake source,,,,,,,,Von_cover,Von_resume,,,,,
Leta,Cummerata,3456 Santina Lane,,Nestorview,KY,27757-8348,US,,mrletacummerata@example.com,1,Internal Sales Facilitator,Under consideration,2022-01-26 10:19:26 UTC,2022-02-04 12:43:23 UTC,Other fake source,,,,,,,,Cummerata_cover,Cummerata_resume,,,,,
Jasmin,Hegmann,87249 Moen Causeway,,Quigleyton,NH,43412,US,,jasminhegmann@example.com,3,Legacy Developer,Schedule face-to-face interview,2022-03-03 04:16:17 UTC,2022-03-07 07:41:47 UTC,Google,,,,,,,,Hegmann_cover,Hegmann_resume,,,,,
Ulysses,Jacobs,301 Wolf View,,Glennview,AR,42602-7198,US,,ulyssesjacobs@example.com,4,Future Advertising Technician,Schedule phone interview,2022-03-08 11:48:36 UTC,2022-03-08 14:45:37 UTC,Other fake source,,,,,,,,Jacobs_cover,Jacobs_resume,Jacobs_work_sample,,,,
Ericka,Auerlld,142 Danial Highway,,South Svetlanahaven,WA,42821-6291,US,,erickaauerlld@example.com,1,Senior Real-Estate Developer,Schedule phone interview,2021-12-31 09:14:47 UTC,2022-02-04 05:14:35 UTC,Craigslist,,,,,,,,Auerlld_cover,Auerlld_resume,,,,,
Jena,Kemmer,8482 Jast Fields,,Buckridgeton,CA,89679,US,,jenakemmer@example.com,5,Legacy Developer,Not Qualified: too crazy,2022-03-03 10:34:21 UTC,2022-03-08 01:54:03 UTC,Google,,,,,,,,Kemmer_cover,Kemmer_resume,,,,,
Eddy,Morar,805 Mueller Tunnel,,Christenaberg,IN,89140-4834,US,,eddymorar@example.com,5,Regional Education Executive,Schedule face-to-face interview,2022-02-04 07:25:53 UTC,2022-03-07 09:08:23 UTC,Craigslist,,,,,,,,Morar_cover,Morar_resume,,,,,
Phebe,Reynolds,6365 Ernser Meadows,,South Ahmed,NJ,87843,US,,phebereynolds@example.com,4,Legacy Developer,Phone interview completed,2022-03-03 07:35:54 UTC,2022-03-04 11:02:03 UTC,Other fake source,,,,,,,,Reynolds_cover,Reynolds_resume,,,,,
Fr. Lonny ,Wisozk,5444 Douglass Fall,,Zeniafurt,AR,66610-3604,US,,frlonnywisozk@example.com,,Future Advertising Technician,Under consideration,2022-03-08 14:42:08 UTC,2022-03-08 15:07:55 UTC,Craigslist,,,,,,,,Wisozk_cover,Wisozk_resume,,,,,
Sarah,Lowe,8342 Edwin Stravenue,,Port Effie,MS,98012,US,,sarahlowe@example.com,5,Legacy Developer,Not Qualified: too crazy,2022-03-08 13:44:37 UTC,2022-03-08 15:19:08 UTC,Google,,,,,,,,Lowe_cover,Lowe_resume,Lowe_work_sample,,,,
Gregorio,Roberts,7248 Schmitt Inlet,,Port Vicenteport,LA,87807-8975,US,,gregorioroberts@example.com,4,Regional Education Executive,Schedule phone interview,2022-03-08 10:23:36 UTC,2022-03-08 12:58:44 UTC,Other fake source,,,,,,,,Roberts_cover,Roberts_resume,,,,,
Bernard,Rath,6282 Rhona Parkways,,Padbergside,NJ,69394-4453,US,,bernardrath@example.com,,Corporate Design Officer,Face-to-face interview completed,2022-03-08 15:12:57 UTC,2022-03-08 15:24:51 UTC,Monster,,,,,,,,Rath_cover,Rath_resume,,,,,
Heather,Schuppe,3509 Towne Drive,,Kirlintown,MD,63309-8133,US,,heatherschuppe@example.com,5,Future Advertising Technician,Under consideration,2022-03-08 15:11:03 UTC,2022-03-08 15:42:57 UTC,Web,,,,,,,,Schuppe_cover,Schuppe_resume,,,,,
Risa,Heidenreich,912 Meryl Orchard,,West Ken,KY,56299-9751,US,,risaheidenreich@example.com,,Internal Sales Facilitator,Under consideration,2022-03-02 03:55:17 UTC,2022-03-07 19:07:01 UTC,FactoryFix,,,,,,,,Heidenreich_cover,Heidenreich_resume,,,,,
Kimber ,Waelchi,695 Hettinger Expressway,,South Tanisha,NJ,77047-3935,US,,preskimberwaelchi@example.com,5,Future Real-Estate Engineer,Schedule phone interview,2022-01-23 21:08:26 UTC,,FactoryFix,,,,,,,,Waelchi_cover,Waelchi_resume,Waelchi_work_sample,,,,
Mary,Turcotte,438 Kraig Village,,North Miloshire,HI,47661,US,,maryturcotte@example.com,,Legacy Developer,Face-to-face interview completed,2022-03-08 14:01:44 UTC,2022-03-08 14:21:50 UTC,Monster,,,,,,,,Turcotte_cover,Turcotte_resume,,,,,